BDBM50529772 CHEMBL4524697
SMILES Cc1ccc(cc1-c1ccc2c(n[nH]c2c1)-c1cnn(C)c1)C(=O)Nc1cccc(c1)C(F)(F)F
InChI Key InChIKey=YDNKVGSHYQPIMR-UHFFFAOYSA-N
Data  4 IC50
  Tab Delimited (TSV)   2D SDfile   Computed 3D by Vconf -m prep SDfile
Find this compound or compounds like it in BindingDB:
Activity Spreadsheet -- Enzyme Inhibition Constant Data from BindingDB
Found 4 hits for monomerid = 50529772
TargetDiscoidin domain-containing receptor 2(Homo sapiens (Human))
Chinese Academy Of Sciences
Curated by ChEMBL
LigandPNGBDBM50529772(CHEMBL4524697)
Affinity DataIC50:  4.40nM. Assay description: Inhibition of DDR2 (unknown origin) using poly (Glu, Tyr) 4:1 substrate after 60 mins by ELISA
Ligand InfoPC cidPC sid
In DepthDetails ArticlePubMed
TargetFibroblast growth factor receptor 1(Homo sapiens (Human))
Chinese Academy Of Sciences
Curated by ChEMBL
LigandPNGBDBM50529772(CHEMBL4524697)
Affinity DataIC50:  6.40nM. Assay description: Inhibition of FGFR1 (unknown origin) after 60 mins by ELISA
Ligand InfoPC cidPC sid
In DepthDetails ArticlePubMed
TargetDiscoidin domain-containing receptor 2(Homo sapiens (Human))
Chinese Academy Of Sciences
Curated by ChEMBL
LigandPNGBDBM50529772(CHEMBL4524697)
Affinity DataIC50:  4.40nM. Assay description: Inhibition of DDR2 (unknown origin) using poly (Glu, Tyr) 4:1 substrate after 60 mins by ELISA
Ligand InfoPC cidPC sid
In DepthDetails ArticlePubMed
TargetFibroblast growth factor receptor 1(Homo sapiens (Human))
Chinese Academy Of Sciences
Curated by ChEMBL
LigandPNGBDBM50529772(CHEMBL4524697)
Affinity DataIC50:  6.40nM. Assay description: Inhibition of FGFR1 (unknown origin) after 60 mins by ELISA
Ligand InfoPC cidPC sid
In DepthDetails ArticlePubMed