BDBM50529851 CHEMBL4565783
SMILES Cc1ccc(F)cc1COc1ccccc1C(=O)Nc1cccnc1
InChI Key InChIKey=LZZHTMJRNQQFCF-UHFFFAOYSA-N
Data  2 IC50
  Tab Delimited (TSV)   2D SDfile   Computed 3D by Vconf -m prep SDfile
Find this compound or compounds like it in BindingDB:
Activity Spreadsheet -- Enzyme Inhibition Constant Data from BindingDB
Found 2 hits for monomerid = 50529851
TargetPhosphatidylcholine:ceramide cholinephosphotransferase 2(Homo sapiens (Human))
Fudan University
Curated by ChEMBL
LigandPNGBDBM50529851(CHEMBL4565783)
Affinity DataIC50:  740nM. Assay description: Inhibition of SMS2 (unknown origin) over-expressed in H5 insect cell lysate using C6-NBD-Ceramide and DMPC as substrates preincubated for 30 mins fol...
Ligand InfoPC cidPC sid
In DepthDetails ArticlePubMed
TargetPhosphatidylcholine:ceramide cholinephosphotransferase 2(Homo sapiens (Human))
Fudan University
Curated by ChEMBL
LigandPNGBDBM50529851(CHEMBL4565783)
Affinity DataIC50:  740nM. Assay description: Inhibition of SMS2 (unknown origin) over-expressed in H5 insect cell lysate using C6-NBD-Ceramide and DMPC as substrates preincubated for 30 mins fol...
Ligand InfoPC cidPC sid
In DepthDetails ArticlePubMed