BDBM50530503 CHEMBL4452579::US11078188, Example 7
SMILES C[C@H]1N(C2CCCC2)c2cc(ccc2N(C)C1=O)-c1nc(nn1-c1ccccc1)C(=O)N1CCN(C)CC1
InChI Key InChIKey=YKCONZYYDHIFDM-HXUWFJFHSA-N
Data  3 IC50
  Tab Delimited (TSV)   2D SDfile   Computed 3D by Vconf -m prep SDfile
Find this compound or compounds like it in BindingDB:
Activity Spreadsheet -- Enzyme Inhibition Constant Data from BindingDB
Found 3 hits for monomerid = 50530503
TargetBromodomain-containing protein 4(Homo sapiens (Human))
University Of Chinese Academy Of Sciences
Curated by ChEMBL
LigandPNGBDBM50530503(CHEMBL4452579 | US11078188, Example 7)
Affinity DataIC50:  7.10nM. Assay description: Displacement of 5-FITC labelled (+)-JQ1 from His6-tagged human BRD4 bromodomain 1 expressed in Escherichia coli BL21(DE3) )-codon plus-RIL cells incu...
Ligand InfoPC cidPC sid
In DepthDetails ArticlePubMed
TargetBromodomain-containing protein 4(Homo sapiens (Human))
University Of Chinese Academy Of Sciences
Curated by ChEMBL
LigandPNGBDBM50530503(CHEMBL4452579 | US11078188, Example 7)
Affinity DataIC50:  7.60nM. Assay description: Expression and purification of the BRD4(I) recognition domain: colonies of newly transformed plasmid DNA from E. coli BL21(DE3)-condon plus-RIL cells...
Ligand InfoPC cidPC sid
In DepthDetails US Patent
TargetBromodomain-containing protein 4(Homo sapiens (Human))
University Of Chinese Academy Of Sciences
Curated by ChEMBL
LigandPNGBDBM50530503(CHEMBL4452579 | US11078188, Example 7)
Affinity DataIC50:  7.10nM. Assay description: Displacement of 5-FITC labelled (+)-JQ1 from His6-tagged human BRD4 bromodomain 1 expressed in Escherichia coli BL21(DE3) )-codon plus-RIL cells incu...
Ligand InfoPC cidPC sid
In DepthDetails ArticlePubMed