BDBM50530516 CHEMBL4587000::US11078188, Example 9
SMILES C[C@H]1N(C2CCCC2)c2cc(ccc2N(C)C1=O)-c1nc(nn1-c1ccc(C)cc1C)C(=O)N1CCN(C)CC1
InChI Key InChIKey=XLDSWHQAEWXEHF-JOCHJYFZSA-N
Data  3 IC50
PDB links: 1 PDB ID matches this monomer.
  Tab Delimited (TSV)   2D SDfile   Computed 3D by Vconf -m prep SDfile
Find this compound or compounds like it in BindingDB:
Activity Spreadsheet -- Enzyme Inhibition Constant Data from BindingDB
Found 3 hits for monomerid = 50530516
TargetBromodomain-containing protein 4(Homo sapiens (Human))
University Of Chinese Academy Of Sciences
Curated by ChEMBL
LigandPNGBDBM50530516(CHEMBL4587000 | US11078188, Example 9)
Affinity DataIC50:  4.5nM. Assay description: Displacement of 5-FITC labelled (+)-JQ1 from His6-tagged human BRD4 bromodomain 1 expressed in Escherichia coli BL21(DE3) )-codon plus-RIL cells incu...
Ligand InfoPC cidPC sidPDB
TargetBromodomain-containing protein 4(Homo sapiens (Human))
University Of Chinese Academy Of Sciences
Curated by ChEMBL
LigandPNGBDBM50530516(CHEMBL4587000 | US11078188, Example 9)
Affinity DataIC50:  8.20nM. Assay description: Expression and purification of the BRD4(I) recognition domain: colonies of newly transformed plasmid DNA from E. coli BL21(DE3)-condon plus-RIL cells...
Ligand InfoPC cidPC sidPDB
TargetBromodomain-containing protein 4(Homo sapiens (Human))
University Of Chinese Academy Of Sciences
Curated by ChEMBL
LigandPNGBDBM50530516(CHEMBL4587000 | US11078188, Example 9)
Affinity DataIC50:  4.5nM. Assay description: Displacement of 5-FITC labelled (+)-JQ1 from His6-tagged human BRD4 bromodomain 1 expressed in Escherichia coli BL21(DE3) )-codon plus-RIL cells incu...
Ligand InfoPC cidPC sidPDB