BDBM50531564 CHEMBL4566513
SMILES COC(=O)C[C@H]1COc2cc(F)ccc2N1C(=O)c1ccc2OCC(=O)Nc2c1
InChI Key InChIKey=PLEGOBVEGCXMTF-ZDUSSCGKSA-N
Data  1 KI  1 IC50
  Tab Delimited (TSV)   2D SDfile   Computed 3D by Vconf -m prep SDfile
Find this compound or compounds like it in BindingDB:
Activity Spreadsheet -- Enzyme Inhibition Constant Data from BindingDB
Found 2 hits for monomerid = 50531564
TargetMineralocorticoid receptor(Homo sapiens (Human))
Pharmaron-Beijing
Curated by ChEMBL
LigandPNGBDBM50531564(CHEMBL4566513)
Affinity DataKi:  63nM. Assay description: Displacement of [3H]-aldosterone to human mineralocorticoid receptor LBD by radiometric binding assay
Ligand InfoPC cidPC sid
In DepthDetails ArticlePubMed
TargetMineralocorticoid receptor(Homo sapiens (Human))
Pharmaron-Beijing
Curated by ChEMBL
LigandPNGBDBM50531564(CHEMBL4566513)
Affinity DataIC50:  316nM. Assay description: Antagonist activity at gal4-fused human mineralocorticoid receptor LBD expressed in UAS-MR-bla HEK293 cells by luciferase reporter gene assay
Ligand InfoPC cidPC sid
In DepthDetails ArticlePubMed