BDBM50531801 CHEMBL4461133
SMILES Nc1ncc(N2CCN(CC2)c2cccc(c2)-c2cccnc2)c(N)n1
InChI Key InChIKey=OAYHPOKXENQPKH-UHFFFAOYSA-N
Data  2 IC50
  Tab Delimited (TSV)   2D SDfile   Computed 3D by Vconf -m prep SDfile
Find this compound or compounds like it in BindingDB:
Activity Spreadsheet -- Enzyme Inhibition Constant Data from BindingDB
Found 2 hits for monomerid = 50531801
TargetBifunctional dihydrofolate reductase-thymidylate synthase(Toxoplasma gondii)
Vyera Pharmaceuticals
Curated by ChEMBL
LigandPNGBDBM50531801(CHEMBL4461133)
Affinity DataIC50:  2.70nM. Assay description: Inhibition of Toxoplasma gondii DHFR-TS expressed in Escherichia coli BL21 competent cells using DHF as substrate preincubated for 15 mins followed b...
Ligand InfoPC cidPC sid
In DepthDetails ArticlePubMed
TargetDihydrofolate reductase(Homo sapiens (Human))
Vyera Pharmaceuticals
Curated by ChEMBL
LigandPNGBDBM50531801(CHEMBL4461133)
Affinity DataIC50:  300nM. Assay description: Inhibition of human DHFR expressed in Escherichia coli BL21 competent cells using DHF as substrate preincubated for 15 mins followed by substrate and...
Ligand InfoPC cidPC sid
In DepthDetails ArticlePubMed