BDBM50531815 CHEMBL4444107
SMILES CC(C)C[C@H](NC(=O)N1CCC(CC1)C(=O)Nc1ccc(F)cc1)C(=O)N[C@@H](Cc1ccccc1)C(=O)N[C@@H](CC(C)C)C(=O)[C@@]1(C)CO1
InChI Key InChIKey=VAOXYJPGSWHPJL-CQMLEQORSA-N
Data  1 IC50
  Tab Delimited (TSV)   2D SDfile   Computed 3D by Vconf -m prep SDfile
Find this compound or compounds like it in BindingDB:
Activity Spreadsheet -- Enzyme Inhibition Constant Data from BindingDB
Found 1 hit for monomerid = 50531815
LigandPNGBDBM50531815(CHEMBL4444107)
Affinity DataIC50:  3.40nM. Assay description: Inhibition of human 20S proteasome preincubated for 15 mins followed by substrate addition
Ligand InfoPC cidPC sid
In DepthDetails ArticlePubMed