BDBM50532099 CHEMBL4443826
SMILES Oc1ccc2OC(C3=C(CCOc4ccc(O)cc34)c2c1)c1ccc(OCCN2CC(CF)C2)cc1
InChI Key InChIKey=KVWZAWLMXSJSPU-UHFFFAOYSA-N
Data  2 IC50
  Tab Delimited (TSV)   2D SDfile   Computed 3D by Vconf -m prep SDfile
Find this compound or compounds like it in BindingDB:
Activity Spreadsheet -- Enzyme Inhibition Constant Data from BindingDB
Found 2 hits for monomerid = 50532099
TargetEstrogen receptor(Homo sapiens (Human))
Genentech
Curated by ChEMBL
LigandPNGBDBM50532099(CHEMBL4443826)
Affinity DataIC50:  3.20nM. Assay description: Induction of ERalpha degradation in human MCF7 cells after 4 hrs by Alexafluor-488 conjugate anti-mouse IgG antibody/Hoechst 33342 staining based imm...
Ligand InfoPC cidPC sid
In DepthDetails ArticlePubMed
TargetEstrogen receptor(Homo sapiens (Human))
Genentech
Curated by ChEMBL
LigandPNGBDBM50532099(CHEMBL4443826)
Affinity DataIC50:  3.20nM. Assay description: Induction of ERalpha degradation in human MCF7 cells after 4 hrs by Alexafluor-488 conjugate anti-mouse IgG antibody/Hoechst 33342 staining based imm...
Ligand InfoPC cidPC sid
In DepthDetails ArticlePubMed