BDBM50532144 CHEMBL4474805
SMILES Oc1ccc(cc1)C(=N\NS(=O)(=O)c1ccc(Cl)cc1Cl)\c1ccccc1
InChI Key InChIKey=IQTDGLHDJSZSCX-ZBJSNUHESA-N
Data  1 IC50
  Tab Delimited (TSV)   2D SDfile   Computed 3D by Vconf -m prep SDfile
Find this compound or compounds like it in BindingDB:
Activity Spreadsheet -- Enzyme Inhibition Constant Data from BindingDB
Found 1 hit for monomerid = 50532144
TargetUrease subunit alpha(Escherichia coli)
University Of Karachi
Curated by ChEMBL
LigandPNGBDBM50532144(CHEMBL4474805)
Affinity DataIC50:  1.80E+4nM. Assay description: Inhibition of bacterial urease using urea as substrate preincubated for 15 mins followed by substrate addition by ELISA
Ligand InfoPC cidPC sid
In DepthDetails ArticlePubMed