BDBM50532152 CHEMBL4572204
SMILES Oc1ccc(cc1)C(=N\NS(=O)(=O)c1cc(Cl)c(Cl)cc1Cl)\c1ccccc1
InChI Key InChIKey=KGVYFBDJZTZLSL-FCDQGJHFSA-N
Data  1 IC50
  Tab Delimited (TSV)   2D SDfile   Computed 3D by Vconf -m prep SDfile
Find this compound or compounds like it in BindingDB:
Activity Spreadsheet -- Enzyme Inhibition Constant Data from BindingDB
Found 1 hit for monomerid = 50532152
TargetUrease subunit alpha(Escherichia coli)
University Of Karachi
Curated by ChEMBL
LigandPNGBDBM50532152(CHEMBL4572204)
Affinity DataIC50:  5.79E+4nM. Assay description: Inhibition of bacterial urease using urea as substrate preincubated for 15 mins followed by substrate addition by ELISA
Ligand InfoPC cidPC sid
In DepthDetails ArticlePubMed