BDBM50532629 CHEMBL4462162
SMILES FC(F)(F)c1ccc(cn1)N1CC[C@@H](C1)NC(=O)Nc1ccc(Cl)c(c1)C(F)(F)F
InChI Key InChIKey=CKVJRBWAZAEHCJ-NSHDSACASA-N
Data  2 IC50
  Tab Delimited (TSV)   2D SDfile   Computed 3D by Vconf -m prep SDfile
Find this compound or compounds like it in BindingDB:
Activity Spreadsheet -- Enzyme Inhibition Constant Data from BindingDB
Found 2 hits for monomerid = 50532629
TargetCyclin-C(Homo sapiens (Human))
Genentech
Curated by ChEMBL
LigandPNGBDBM50532629(CHEMBL4462162)
Affinity DataIC50:  117nM. Assay description: Displacement of tracer236 from full-length His-tagged CDK8/cyclin C (unknown origin) incubated for 1 hr by TR-FRET analysis
Ligand InfoPC cidPC sid
In DepthDetails ArticlePubMed
TargetCyclin-C(Homo sapiens (Human))
Genentech
Curated by ChEMBL
LigandPNGBDBM50532629(CHEMBL4462162)
Affinity DataIC50:  117nM. Assay description: Displacement of tracer236 from full-length His-tagged CDK8/cyclin C (unknown origin) incubated for 1 hr by TR-FRET analysis
Ligand InfoPC cidPC sid
In DepthDetails ArticlePubMed