BDBM50532883 CHEMBL2136920
SMILES COc1ccccc1-c1ccc(cc1)-c1cn(nn1)C(=O)N1CCCCC1Cc1ccccc1
InChI Key InChIKey=MXVVJNJNDCJCFS-UHFFFAOYSA-N
Data  6 IC50
  Tab Delimited (TSV)   2D SDfile   Computed 3D by Vconf -m prep SDfile
Find this compound or compounds like it in BindingDB:
Activity Spreadsheet -- Enzyme Inhibition Constant Data from BindingDB
Found 6 hits for monomerid = 50532883
TargetDiacylglycerol lipase-beta(Mus musculus)
Leiden University
Curated by ChEMBL
LigandPNGBDBM50532883(CHEMBL2136920)
Affinity DataIC50:  79nM. Assay description: Inhibition of V-tagged mouse DAGLbeta expressed in HEK2934T cell membrane fractions using SAG as substrate assessed as accumulation of 2-AG preincuba...
In DepthDetails ArticlePubMed
TargetDiacylglycerol lipase-beta(Mus musculus)
Leiden University
Curated by ChEMBL
LigandPNGBDBM50532883(CHEMBL2136920)
Affinity DataIC50:  79nM. Assay description: Inhibition of V-tagged mouse DAGLbeta expressed in HEK2934T cell membrane fractions using SAG as substrate assessed as accumulation of 2-AG preincuba...
In DepthDetails ArticlePubMed
TargetDiacylglycerol lipase-alpha(Homo sapiens (Human))
Leiden University
Curated by ChEMBL
LigandPNGBDBM50532883(CHEMBL2136920)
Affinity DataIC50:  126nM. Assay description: Inhibition human DAGLalpha expressed in HEK293T cell membrane fractions using DAG as substrate preincubated for 30 mins followed by ABP HT01 probe ad...
In DepthDetails ArticlePubMed
TargetDiacylglycerol lipase-beta(Mus musculus)
Leiden University
Curated by ChEMBL
LigandPNGBDBM50532883(CHEMBL2136920)
Affinity DataIC50:  63nM. Assay description: Inhibition mouse DAGLbeta expressed in HEK293T cell membrane fractions using DAG as substrate preincubated for 30 mins followed by ABP HT01 probe add...
In DepthDetails ArticlePubMed
TargetDiacylglycerol lipase-alpha(Homo sapiens (Human))
Leiden University
Curated by ChEMBL
LigandPNGBDBM50532883(CHEMBL2136920)
Affinity DataIC50:  126nM. Assay description: Inhibition human DAGLalpha expressed in HEK293T cell membrane fractions using DAG as substrate preincubated for 30 mins followed by ABP HT01 probe ad...
In DepthDetails ArticlePubMed
TargetDiacylglycerol lipase-beta(Mus musculus)
Leiden University
Curated by ChEMBL
LigandPNGBDBM50532883(CHEMBL2136920)
Affinity DataIC50:  63nM. Assay description: Inhibition mouse DAGLbeta expressed in HEK293T cell membrane fractions using DAG as substrate preincubated for 30 mins followed by ABP HT01 probe add...
In DepthDetails ArticlePubMed