BDBM50533159 CHEMBL4454070
SMILES CNC(=O)Nc1cc(Oc2cncc(C)c2)c(cn1)-c1ccc(OCC(C)(C)O)nc1
InChI Key InChIKey=QUISANLDBDCMPD-UHFFFAOYSA-N
Data  4 EC50
  Tab Delimited (TSV)   2D SDfile   Computed 3D by Vconf -m prep SDfile
Find this compound or compounds like it in BindingDB:
Activity Spreadsheet -- Enzyme Inhibition Constant Data from BindingDB
Found 4 hits for monomerid = 50533159
TargetHexokinase-4(Homo sapiens (Human))
Amgen
Curated by ChEMBL
LigandPNGBDBM50533159(CHEMBL4454070)
Affinity DataEC50:  220nM. Assay description: Activation of human recombinant glucokinase using 5 mM glucose monitored over 5 mins in presence of NAD+ and glucose 6-phosphate 4% human serum album...
In DepthDetails ArticlePubMed
TargetHexokinase-4(Homo sapiens (Human))
Amgen
Curated by ChEMBL
LigandPNGBDBM50533159(CHEMBL4454070)
Affinity DataEC50:  60nM. Assay description: Activation of human recombinant glucokinase using 5 mM glucose monitored over 5 mins in presence of NAD+ by glucose 6-phosphate dehydrogenase coupled...
In DepthDetails ArticlePubMed
TargetHexokinase-4(Homo sapiens (Human))
Amgen
Curated by ChEMBL
LigandPNGBDBM50533159(CHEMBL4454070)
Affinity DataEC50:  220nM. Assay description: Activation of human recombinant glucokinase using 5 mM glucose monitored over 5 mins in presence of NAD+ and glucose 6-phosphate 4% human serum album...
In DepthDetails ArticlePubMed
TargetHexokinase-4(Homo sapiens (Human))
Amgen
Curated by ChEMBL
LigandPNGBDBM50533159(CHEMBL4454070)
Affinity DataEC50:  60nM. Assay description: Activation of human recombinant glucokinase using 5 mM glucose monitored over 5 mins in presence of NAD+ by glucose 6-phosphate dehydrogenase coupled...
In DepthDetails ArticlePubMed