BDBM50533173 CHEMBL4453105
SMILES CNC(=O)Nc1cc(Oc2c(F)cccc2F)c(C)cn1
InChI Key InChIKey=PMXOXZSVWGIOEG-UHFFFAOYSA-N
Data  4 EC50
  Tab Delimited (TSV)   2D SDfile   Computed 3D by Vconf -m prep SDfile
Find this compound or compounds like it in BindingDB:
Activity Spreadsheet -- Enzyme Inhibition Constant Data from BindingDB
Found 4 hits for monomerid = 50533173
TargetHexokinase-4(Homo sapiens (Human))
Amgen
Curated by ChEMBL
LigandPNGBDBM50533173(CHEMBL4453105)
Affinity DataEC50:  120nM. Assay description: Activation of human recombinant glucokinase using 5 mM glucose monitored over 5 mins in presence of NAD+ by glucose 6-phosphate dehydrogenase coupled...
Ligand InfoPC cidPC sid
In DepthDetails ArticlePubMed
TargetHexokinase-4(Homo sapiens (Human))
Amgen
Curated by ChEMBL
LigandPNGBDBM50533173(CHEMBL4453105)
Affinity DataEC50:  3.50E+3nM. Assay description: Activation of human recombinant glucokinase using 5 mM glucose monitored over 5 mins in presence of NAD+ and glucose 6-phosphate 4% human serum album...
Ligand InfoPC cidPC sid
In DepthDetails ArticlePubMed
TargetHexokinase-4(Homo sapiens (Human))
Amgen
Curated by ChEMBL
LigandPNGBDBM50533173(CHEMBL4453105)
Affinity DataEC50:  3.50E+3nM. Assay description: Activation of human recombinant glucokinase using 5 mM glucose monitored over 5 mins in presence of NAD+ and glucose 6-phosphate 4% human serum album...
Ligand InfoPC cidPC sid
In DepthDetails ArticlePubMed
TargetHexokinase-4(Homo sapiens (Human))
Amgen
Curated by ChEMBL
LigandPNGBDBM50533173(CHEMBL4453105)
Affinity DataEC50:  120nM. Assay description: Activation of human recombinant glucokinase using 5 mM glucose monitored over 5 mins in presence of NAD+ by glucose 6-phosphate dehydrogenase coupled...
Ligand InfoPC cidPC sid
In DepthDetails ArticlePubMed