BDBM50533229 CHEMBL4446613
SMILES Fc1ccc(c(F)c1)-c1cc(Nc2ccncc2)c2cc[nH]c2n1
InChI Key InChIKey=ILRGLUAABODDJU-UHFFFAOYSA-N
Data  8 IC50  2 EC50
  Tab Delimited (TSV)   2D SDfile   Computed 3D by Vconf -m prep SDfile
Find this compound or compounds like it in BindingDB:
Activity Spreadsheet -- Enzyme Inhibition Constant Data from BindingDB
Found 10 hits for monomerid = 50533229
TargetCytochrome P450 3A4(Homo sapiens (Human))
Takeda California
Curated by ChEMBL
LigandPNGBDBM50533229(CHEMBL4446613)
Affinity DataIC50:  1.26E+3nM. Assay description: Inhibition of CYP3A4 (unknown origin)
Ligand InfoPC cidPC sid
In DepthDetails ArticlePubMed
TargetTGF-beta receptor type-1(Homo sapiens (Human))
Takeda California
Curated by ChEMBL
LigandPNGBDBM50533229(CHEMBL4446613)
Affinity DataEC50:  25nM. Assay description: Inhibition of ALK5 in TGF beta1-stimulated HEK293T cells by SMAD binding element-driven beta lactamase reporter gene assay
Ligand InfoPC cidPC sid
In DepthDetails ArticlePubMed
TargetTGF-beta receptor type-1(Homo sapiens (Human))
Takeda California
Curated by ChEMBL
LigandPNGBDBM50533229(CHEMBL4446613)
Affinity DataIC50:  32nM. Assay description: Inhibition of ALK5 (unknown origin) using fluorescein-labeled peptide substrate incubated for 90 mins by TR-FRET assay
Ligand InfoPC cidPC sid
In DepthDetails ArticlePubMed
TargetTGF-beta receptor type-1(Homo sapiens (Human))
Takeda California
Curated by ChEMBL
LigandPNGBDBM50533229(CHEMBL4446613)
Affinity DataEC50:  25nM. Assay description: Inhibition of ALK5 in TGF beta1-stimulated HEK293T cells by SMAD binding element-driven beta lactamase reporter gene assay
Ligand InfoPC cidPC sid
In DepthDetails ArticlePubMed
TargetCytochrome P450 2C8(Homo sapiens (Human))
Takeda California
Curated by ChEMBL
LigandPNGBDBM50533229(CHEMBL4446613)
Affinity DataIC50:  79nM. Assay description: Inhibition of CYP2C8 (unknown origin)
Ligand InfoPC cidPC sid
In DepthDetails ArticlePubMed
TargetCytochrome P450 3A4(Homo sapiens (Human))
Takeda California
Curated by ChEMBL
LigandPNGBDBM50533229(CHEMBL4446613)
Affinity DataIC50:  1.26E+3nM. Assay description: Inhibition of CYP3A4 (unknown origin)
Ligand InfoPC cidPC sid
In DepthDetails ArticlePubMed
TargetCytochrome P450 1A2(Homo sapiens (Human))
Takeda California
Curated by ChEMBL
LigandPNGBDBM50533229(CHEMBL4446613)
Affinity DataIC50:  316nM. Assay description: Inhibition of CYP1A2 (unknown origin)
Ligand InfoPC cidPC sid
In DepthDetails ArticlePubMed
TargetCytochrome P450 2C8(Homo sapiens (Human))
Takeda California
Curated by ChEMBL
LigandPNGBDBM50533229(CHEMBL4446613)
Affinity DataIC50:  79nM. Assay description: Inhibition of CYP2C8 (unknown origin)
Ligand InfoPC cidPC sid
In DepthDetails ArticlePubMed
TargetCytochrome P450 1A2(Homo sapiens (Human))
Takeda California
Curated by ChEMBL
LigandPNGBDBM50533229(CHEMBL4446613)
Affinity DataIC50:  316nM. Assay description: Inhibition of CYP1A2 (unknown origin)
Ligand InfoPC cidPC sid
In DepthDetails ArticlePubMed
TargetTGF-beta receptor type-1(Homo sapiens (Human))
Takeda California
Curated by ChEMBL
LigandPNGBDBM50533229(CHEMBL4446613)
Affinity DataIC50:  32nM. Assay description: Inhibition of ALK5 (unknown origin) using fluorescein-labeled peptide substrate incubated for 90 mins by TR-FRET assay
Ligand InfoPC cidPC sid
In DepthDetails ArticlePubMed