BDBM50534299 CHEMBL4450133
SMILES C(Oc1cccc(c1)-c1cn(nn1)[C@@H]1CN2CCC1CC2)c1ccccc1
InChI Key InChIKey=VJEPFPRUUZASOL-JOCHJYFZSA-N
Data  3 KI
  Tab Delimited (TSV)   2D SDfile   Computed 3D by Vconf -m prep SDfile
Find this compound or compounds like it in BindingDB:
Activity Spreadsheet -- Enzyme Inhibition Constant Data from BindingDB
Found 3 hits for monomerid = 50534299
TargetNeuronal acetylcholine receptor subunit alpha-3/beta-4(Homo sapiens (Human))
Mahidol University
Curated by ChEMBL
LigandPNGBDBM50534299(CHEMBL4450133)
Affinity DataKi:  6.70nM. Assay description: Displacement of [3H]epibatidine from human alpha3beta4 nAChR transfected in HEK293 cell membranes after 120 mins by liquid scintillation counting
Ligand InfoPC cidPC sid
In DepthDetails ArticlePubMed
TargetNeuronal acetylcholine receptor subunit alpha-7(Homo sapiens (Human))
Mahidol University
Curated by ChEMBL
LigandPNGBDBM50534299(CHEMBL4450133)
Affinity DataKi:  279nM. Assay description: Displacement of [3H]MLA from human alpha7 nAChR transfected in human SH-SY5Y cell membranes after 120 mins by liquid scintillation counting
Ligand InfoPC cidPC sid
In DepthDetails ArticlePubMed
TargetNeuronal acetylcholine receptor subunit alpha-4/beta-2(Homo sapiens (Human))
Mahidol University
Curated by ChEMBL
LigandPNGBDBM50534299(CHEMBL4450133)
Affinity DataKi:  414nM. Assay description: Displacement of [3H]epibatidine from human alpha4beta2 nAChR transfected in HEK293 cell membranes after 120 mins by liquid scintillation counting
Ligand InfoPC cidPC sid
In DepthDetails ArticlePubMed