BDBM50534360 CHEMBL4538043
SMILES COc1cc(ccc1-n1cnc(C)c1)-c1csc(n1)N1CCCn2nc3CCCCc3c12
InChI Key InChIKey=NAVWBLXQSXUGNU-UHFFFAOYSA-N
Data  1 EC50
  Tab Delimited (TSV)   2D SDfile   Computed 3D by Vconf -m prep SDfile
Find this compound or compounds like it in BindingDB:
Activity Spreadsheet -- Enzyme Inhibition Constant Data from BindingDB
Found 1 hit for monomerid = 50534360
TargetPresenilin-1(Homo sapiens (Human))
Forum Pharmaceuticals
Curated by ChEMBL
LigandPNGBDBM50534360(CHEMBL4538043)
Affinity DataEC50:  6nM. Assay description: Modulation of gamma-secretase in human SH-SY5Y cells expressing human APP751 assessed as reduction in amyloid beta 42 production after 16 to 18 hrs b...
Ligand InfoPC cidPC sid
In DepthDetails ArticlePubMed