BDBM50534783 CHEMBL4575318
SMILES [#6]-[#8]-[#6](=O)-[#6]-[#6]-[#6]-[#7]-[#6](=O)-c1ccccc1[Se;v2][Se;v2]c1ccccc1-[#6](=O)-[#7]-[#6]-[#6]-[#6]-[#6](=O)-[#8]-[#6]
InChI Key InChIKey=DHUHMTRHYULEGM-UHFFFAOYSA-N
Data  1 KI  2 IC50
  Tab Delimited (TSV)   2D SDfile   Computed 3D by Vconf -m prep SDfile
Find this compound or compounds like it in BindingDB:
Activity Spreadsheet -- Enzyme Inhibition Constant Data from BindingDB
Found 3 hits for monomerid = 50534783
TargetUrease subunit beta(Helicobacter pylori (strain ATCC 700392 / 26695) (...)
Wroc?Aw University Of Technology
Curated by ChEMBL
LigandPNGBDBM50534783(CHEMBL4575318)
Affinity DataKi:  184nM. Assay description: Inhibition of recombinant Helicobacter pylori urease expressed in Escherichia coli rosetta DE3 after 120 mins by Berthelot colorimetric analysis
Ligand InfoPC cidPC sid
In DepthDetails ArticlePubMed
TargetUrease subunit beta(Helicobacter pylori (strain ATCC 700392 / 26695) (...)
Wroc?Aw University Of Technology
Curated by ChEMBL
LigandPNGBDBM50534783(CHEMBL4575318)
Affinity DataIC50:  1.18E+4nM. Assay description: Inhibition of urease in Helicobacter pylori J99 in Brucella broth using urea as substrate preincubated for 2 hrs followed by substrate addition measu...
Ligand InfoPC cidPC sid
In DepthDetails ArticlePubMed
TargetUrease subunit beta(Helicobacter pylori (strain ATCC 700392 / 26695) (...)
Wroc?Aw University Of Technology
Curated by ChEMBL
LigandPNGBDBM50534783(CHEMBL4575318)
Affinity DataIC50:  2.01E+4nM. Assay description: Inhibition of recombinant Helicobacter pylori urease expressed in Escherichia coli rosetta DE3 using urea as substrate assessed as transformed cell u...
Ligand InfoPC cidPC sid
In DepthDetails ArticlePubMed