BDBM50535686 CHEMBL4562557
SMILES Fc1cccc2c(Cc3cc4ccccc4[nH]3)c[nH]c12
InChI Key InChIKey=YGYQRHOQOUPIIZ-UHFFFAOYSA-N
Data  1 IC50
  Tab Delimited (TSV)   2D SDfile   Computed 3D by Vconf -m prep SDfile
Find this compound or compounds like it in BindingDB:
Activity Spreadsheet -- Enzyme Inhibition Constant Data from BindingDB
Found 1 hit for monomerid = 50535686
TargetProprotein convertase subtilisin/kexin type 9(Homo sapiens (Human))
University Of Wisconsin
Curated by ChEMBL
LigandPNGBDBM50535686(CHEMBL4562557)
Affinity DataIC50:  300nM. Assay description: Inhibition of human PCSK9 in HepG2 cells incubated for 48 hrs by AlphaLISA assay
Ligand InfoPC cidPC sid
In DepthDetails ArticlePubMed