BDBM50535689 CHEMBL4462933
SMILES Cc1c(Cc2cn(C)c3ccccc23)n(c2ccccc12)S(=O)(=O)c1ccc(C)cc1
InChI Key InChIKey=QBHDQZHITANWAH-UHFFFAOYSA-N
Data  1 IC50
  Tab Delimited (TSV)   2D SDfile   Computed 3D by Vconf -m prep SDfile
Find this compound or compounds like it in BindingDB:
Activity Spreadsheet -- Enzyme Inhibition Constant Data from BindingDB
Found 1 hit for monomerid = 50535689
TargetProprotein convertase subtilisin/kexin type 9(Homo sapiens (Human))
University Of Wisconsin
Curated by ChEMBL
LigandPNGBDBM50535689(CHEMBL4462933)
Affinity DataIC50:  1.50E+3nM. Assay description: Inhibition of human PCSK9 in HepG2 cells incubated for 48 hrs by AlphaLISA assay
Ligand InfoPC cidPC sid
In DepthDetails ArticlePubMed