BDBM50536238 CHEMBL4513308
SMILES CC[C@H](N(C(=O)[C@H]1CC[C@H](C)CC1)c1cc(sc1C(O)=O)C#CC(C)(C)C)C(=O)N(C)C
InChI Key InChIKey=JWIBANYZPONULW-LNLFQRSKSA-N
Data  2 EC50
  Tab Delimited (TSV)   2D SDfile   Computed 3D by Vconf -m prep SDfile
Find this compound or compounds like it in BindingDB:
Activity Spreadsheet -- Enzyme Inhibition Constant Data from BindingDB
Found 2 hits for monomerid = 50536238
TargetNonstructural protein 5A(Hepatitis C virus)
Vertex Pharmaceuticals
Curated by ChEMBL
LigandPNGBDBM50536238(CHEMBL4513308)
Affinity DataEC50:  24nM. Assay description: Allosteric inhibition of HCV genotype 1a NS5A infected in human W11.8 cells assessed as reduction in viral RNA replication after 4 days by ELISA
Ligand InfoPC cidPC sid
In DepthDetails ArticlePubMed
TargetNonstructural protein 5A(Hepatitis C virus)
Vertex Pharmaceuticals
Curated by ChEMBL
LigandPNGBDBM50536238(CHEMBL4513308)
Affinity DataEC50:  16nM. Assay description: Allosteric inhibition of HCV genotype 1b NS5A infected in human l389lucubi- neo/NS3-375.1-containing Huh7ET cells assessed as RNA replication/transla...
Ligand InfoPC cidPC sid
In DepthDetails ArticlePubMed