BDBM50536249 CHEMBL4550700
SMILES C[C@H]1CC[C@@H](CC1)C(=O)N(CC(=O)N1CCN(C)CC1)c1cc(sc1C(O)=O)C#CC(C)(C)C
InChI Key InChIKey=BFEWIXKVLPSABN-WGSAOQKQSA-N
Data  1 EC50
  Tab Delimited (TSV)   2D SDfile   Computed 3D by Vconf -m prep SDfile
Find this compound or compounds like it in BindingDB:
Activity Spreadsheet -- Enzyme Inhibition Constant Data from BindingDB
Found 1 hit for monomerid = 50536249
TargetNonstructural protein 5A(Hepatitis C virus)
Vertex Pharmaceuticals
Curated by ChEMBL
LigandPNGBDBM50536249(CHEMBL4550700)
Affinity DataEC50:  6nM. Assay description: Allosteric inhibition of HCV genotype 1b NS5A infected in human l389lucubi- neo/NS3-375.1-containing Huh7ET cells assessed as RNA replication/transla...
Ligand InfoPC cidPC sid
In DepthDetails ArticlePubMed