BDBM50536313 CHEMBL4529072
SMILES CCOc1ccccc1Nc1nc(cs1)-c1sc(NC(=O)CC)nc1C
InChI Key InChIKey=ZNDHWIRRSGUUEU-UHFFFAOYSA-N
Data  1 IC50
  Tab Delimited (TSV)   2D SDfile   Computed 3D by Vconf -m prep SDfile
Find this compound or compounds like it in BindingDB:
Activity Spreadsheet -- Enzyme Inhibition Constant Data from BindingDB
Found 1 hit for monomerid = 50536313
TargetSerine/threonine-protein kinase TAO2(Rattus norvegicus)
University Of Texas Southwestern Medical Center
Curated by ChEMBL
LigandPNGBDBM50536313(CHEMBL4529072)
Affinity DataIC50:  600nM. Assay description: Inhibition of rat TAOK2 (1 to 320 residues) expressed in Baculovirus/insect cell expression system assessed as remaining activity using MBP as substr...
In DepthDetails ArticlePubMed