BDBM50536346 CHEMBL4544171
SMILES CN1C(NC(=O)CCCOC2CCCCC2)Sc2cc(ccc12)S(C)(=O)=O
InChI Key InChIKey=QGANDWZVMMCZJO-UHFFFAOYSA-N
Data  1 IC50
  Tab Delimited (TSV)   2D SDfile   Computed 3D by Vconf -m prep SDfile
Find this compound or compounds like it in BindingDB:
Activity Spreadsheet -- Enzyme Inhibition Constant Data from BindingDB
Found 1 hit for monomerid = 50536346
TargetSerine/threonine-protein kinase TAO2(Rattus norvegicus)
University Of Texas Southwestern Medical Center
Curated by ChEMBL
LigandPNGBDBM50536346(CHEMBL4544171)
Affinity DataIC50:  1.90E+3nM. Assay description: Inhibition of rat TAOK2 (1 to 320 residues) expressed in Baculovirus/insect cell expression system assessed as remaining activity using MBP as substr...
Ligand InfoPC cidPC sid
In DepthDetails ArticlePubMed