BDBM50536355 CHEMBL4569913
SMILES CC(=O)Nc1nc(C)c(s1)-c1csc(Nc2ccccc2C)n1
InChI Key InChIKey=PFYDDCPPENGVGJ-UHFFFAOYSA-N
Data  1 IC50
  Tab Delimited (TSV)   2D SDfile   Computed 3D by Vconf -m prep SDfile
Find this compound or compounds like it in BindingDB:
Activity Spreadsheet -- Enzyme Inhibition Constant Data from BindingDB
Found 1 hit for monomerid = 50536355
TargetSerine/threonine-protein kinase TAO2(Rattus norvegicus)
University Of Texas Southwestern Medical Center
Curated by ChEMBL
LigandPNGBDBM50536355(CHEMBL4569913)
Affinity DataIC50:  1.80E+3nM. Assay description: Inhibition of rat TAOK2 (1 to 320 residues) expressed in Baculovirus/insect cell expression system assessed as remaining activity using MBP as substr...
In DepthDetails ArticlePubMed