BDBM50537149 CHEMBL4532088
SMILES CNC(=O)CCC(CC(=O)Nc1ccc(C)cc1C)c1nnc(CCCC(C)C)n1C1CC1
InChI Key InChIKey=VZZSMDAIIRSGOW-UHFFFAOYSA-N
Data  1 EC50
  Tab Delimited (TSV)   2D SDfile   Computed 3D by Vconf -m prep SDfile
Find this compound or compounds like it in BindingDB:
Activity Spreadsheet -- Enzyme Inhibition Constant Data from BindingDB
Found 1 hit for monomerid = 50537149
TargetNuclear receptor ROR-gamma(Homo sapiens (Human))
Kyoto Prefectural University Of Medicine
Curated by ChEMBL
LigandPNGBDBM50537149(CHEMBL4532088)
Affinity DataEC50:  6.40E+3nM. Assay description: Inhibition of human GAL4-fused RORgamma LBD transcriptional activity expressed in CHOK1 cells after 2 days by luciferase reporter gene assay
Ligand InfoPC cidPC sid
In DepthDetails ArticlePubMed