BDBM50537157 CHEMBL4593726
SMILES [Na;v0+].[#6]C([#6])([#6])C(F)(F)c1cc(no1)-c1onc(-[#6@@H](-[#6]-[#6]-[#6](-[#8-])=O)-[#6]-[#6](=O)-[#7]-c2ccc(Cl)cc2F)c1-[#6]-1-[#6]-[#6]-1
InChI Key InChIKey=VXNMQVJFCSVCFV-UQKRIMTDSA-M
Data  1 EC50
  Tab Delimited (TSV)   2D SDfile   Computed 3D by Vconf -m prep SDfile
Find this compound or compounds like it in BindingDB:
Activity Spreadsheet -- Enzyme Inhibition Constant Data from BindingDB
Found 1 hit for monomerid = 50537157
TargetNuclear receptor ROR-gamma(Homo sapiens (Human))
Kyoto Prefectural University Of Medicine
Curated by ChEMBL
LigandPNGBDBM50537157(CHEMBL4593726)
Affinity DataEC50:  7nM. Assay description: Inhibition of human GAL4-fused RORgamma LBD transcriptional activity expressed in CHOK1 cells after 2 days by luciferase reporter gene assay
Ligand InfoPC cidPC sid
In DepthDetails ArticlePubMed