BDBM50537158 CHEMBL4514578
SMILES CC(C)CCCc1nnc(C(CCN)CC(=O)Nc2ccc(C)cc2C)n1C1CC1
InChI Key InChIKey=NVCMJGZWAKZEDM-UHFFFAOYSA-N
Data  1 EC50
  Tab Delimited (TSV)   2D SDfile   Computed 3D by Vconf -m prep SDfile
Find this compound or compounds like it in BindingDB:
Activity Spreadsheet -- Enzyme Inhibition Constant Data from BindingDB
Found 1 hit for monomerid = 50537158
TargetNuclear receptor ROR-gamma(Homo sapiens (Human))
Kyoto Prefectural University Of Medicine
Curated by ChEMBL
LigandPNGBDBM50537158(CHEMBL4514578)
Affinity DataEC50: >2.00E+4nM. Assay description: Inhibition of human GAL4-fused RORgamma LBD transcriptional activity expressed in CHOK1 cells after 2 days by luciferase reporter gene assay
Ligand InfoPC cidPC sid
In DepthDetails ArticlePubMed