BDBM50537162 CHEMBL4570149
SMILES [Na;v0+].[#6]-[#6](-[#6])C(F)(F)c1cc(no1)-c1onc(-[#6@@H](-[#6]-[#6]-[#6](-[#8-])=O)-[#6]-[#6](=O)-[#7]-c2ccc(-[#6])cc2Cl)c1-[#6]-1-[#6]-[#6]-1
InChI Key InChIKey=YLCHKTDVTMEQBL-NTISSMGPSA-M
Data  1 EC50
  Tab Delimited (TSV)   2D SDfile   Computed 3D by Vconf -m prep SDfile
Find this compound or compounds like it in BindingDB:
Activity Spreadsheet -- Enzyme Inhibition Constant Data from BindingDB
Found 1 hit for monomerid = 50537162
TargetNuclear receptor ROR-gamma(Homo sapiens (Human))
Kyoto Prefectural University Of Medicine
Curated by ChEMBL
LigandPNGBDBM50537162(CHEMBL4570149)
Affinity DataEC50:  7nM. Assay description: Inhibition of human GAL4-fused RORgamma LBD transcriptional activity expressed in CHOK1 cells after 2 days by luciferase reporter gene assay
Ligand InfoPC cidPC sid
In DepthDetails ArticlePubMed