BDBM50537997 CHEMBL4639270
SMILES Oc1ccc(Cc2cc(oc(=O)c2Cc2ccc(O)cc2O)-c2ccc(O)cc2)cc1
InChI Key InChIKey=ALOKGBOHBCZWBY-UHFFFAOYSA-N
Data  1 IC50
  Tab Delimited (TSV)   2D SDfile   Computed 3D by Vconf -m prep SDfile
Find this compound or compounds like it in BindingDB:
Activity Spreadsheet -- Enzyme Inhibition Constant Data from BindingDB
Found 1 hit for monomerid = 50537997
TargetCysteine protease(Trypanosoma brucei rhodesiense)
University Of Halle-Wittenberg
Curated by ChEMBL
LigandPNGBDBM50537997(CHEMBL4639270)
Affinity DataIC50:  6.30E+4nM. Assay description: Inhibition of Trypanosoma brucei rhodesiense C-terminal full length rhodesain expressed in Pichia pastoris using Cbz-PheArg-AMC as substrate measured...
Ligand InfoPC cidPC sid
In DepthDetails ArticlePubMed