BDBM50538238 CHEMBL4642849
SMILES CC(C)[C@H](NC(=O)[C@@H](CC(O)=O)NC(=O)[C@H](Cc1c[nH]cn1)NC(=O)CN(C)C(=O)CN(C)C(=O)CN(C)C(=O)CN(C)CC(=O)N(C)CC(=O)N(C)CC(=O)N(C)CC(=O)N(C)CC(=O)N(C)CC(=O)N(C)C(=O)CCN)C(=O)N1CCC[C@H]1C(=O)N[C@@H]1CSCc2cc3CSC[C@@H](NC(=O)[C@@H](CC(O)=O)NC(=O)[C@@H]4CCCN4C(=O)[C@H](CCCCNC(N)=N)NC(=O)[C@H](CC(N)=O)NC(=O)[C@@H](NC(=O)[C@@H]4CCCN4C(=O)[C@H](CSCc(c3)c2)NC(=O)[C@H](Cc2cccc3ccccc23)NC(=O)[C@H](Cc2ccccc2)NC(=O)C(C)(C)NC(=O)CNC(=O)[C@H](Cc2cccc3ccccc23)NC(=O)C(C)(C)NC1=O)C(C)(C)C)C(N)=O
InChI Key InChIKey=NPVQLUONYRGXER-VQQBFFDLSA-N
Data  1 KI
  Tab Delimited (TSV)   2D SDfile   Computed 3D by Vconf -m prep SDfile
Find this compound or compounds like it in BindingDB:
Activity Spreadsheet -- Enzyme Inhibition Constant Data from BindingDB
Found 1 hit for monomerid = 50538238
TargetEphrin type-A receptor 2(Homo sapiens (Human))
Bicycletx
Curated by ChEMBL
LigandPNGBDBM50538238(CHEMBL4642849)
Affinity DataKi:  2.80nM. Assay description: Binding affinity to 6x-His-tagged human EphA2 ecto-domain residues (Lys27 to Asn529 residues) expressed in HEK293 cells incubated for 60 mins by fluo...
Ligand InfoKEGGPC cidPC sid
In DepthDetails ArticlePubMed