BDBM50538242 CHEMBL4634115
SMILES [H][C@@]12CCCN1C(=O)[C@H](CCC(O)=O)NC(=O)[C@H](CC(C)C)NC(=O)CNC(=O)[C@H](CCSC)NC(=O)[C@H](Cc1ccccc1)NC(=O)CNC(=O)[C@H](CSCCC(=O)N1CN3CN(C1)C(=O)CCSC[C@]([H])(NC2=O)C(=O)N[C@@H](CCC(O)=O)C(=O)N[C@@H](CO)C(=O)N[C@@H](CO)C(=O)N[C@@H](CSCCC3=O)C(=O)N[C@@H](C)C(N)=O)NC(=O)[C@H](C)N
InChI Key InChIKey=QGCWMKKXMBXLMS-OAEMITKSSA-N
Data  1 KI
  Tab Delimited (TSV)   2D SDfile   Computed 3D by Vconf -m prep SDfile
Find this compound or compounds like it in BindingDB:
Activity Spreadsheet -- Enzyme Inhibition Constant Data from BindingDB
Found 1 hit for monomerid = 50538242
TargetEphrin type-A receptor 2(Homo sapiens (Human))
Bicycletx
Curated by ChEMBL
LigandPNGBDBM50538242(CHEMBL4634115)
Affinity DataKi:  3.10E+3nM. Assay description: Binding affinity to 6x-His-tagged human EphA2 ecto-domain residues (Lys27 to Asn529 residues) expressed in HEK293 cells incubated for 60 mins by fluo...
Ligand InfoKEGGPC cidPC sid
In DepthDetails ArticlePubMed