BDBM50538259 CHEMBL4637500
SMILES [H][C@@]12CCCN1C(=O)[C@H](Cc1c[nH]cn1)NC(=O)[C@H](CC(C)C)NC(=O)[C@@H]1CSCCC(=O)N3CN(CN(C3)C(=O)CCSC[C@H](NC(=O)[C@H](CC(O)=O)NC(=O)[C@H](CCCCNC(N)=N)NC(=O)[C@H](C)N)C(=O)N3CCC[C@@]3([H])C(=O)N[C@@H](CC(C)C)C(=O)N[C@@H](C(C)C)C(=O)N[C@@H](CC(N)=O)C(=O)N3CCC[C@@]3([H])C(=O)N[C@@H](CC(C)C)C(=O)N1)C(=O)CCSC[C@H](NC(=O)[C@@]([H])(NC(=O)[C@H](Cc1c[nH]c3ccccc13)NC(=O)CNC2=O)[C@@H](C)O)C(=O)N[C@@H](C)C(N)=O
InChI Key InChIKey=RJMSLYBQWOONJO-DWZUWRIVSA-N
Data  1 KI
  Tab Delimited (TSV)   2D SDfile   Computed 3D by Vconf -m prep SDfile
Find this compound or compounds like it in BindingDB:
Activity Spreadsheet -- Enzyme Inhibition Constant Data from BindingDB
Found 1 hit for monomerid = 50538259
TargetEphrin type-A receptor 2(Homo sapiens (Human))
Bicycletx
Curated by ChEMBL
LigandPNGBDBM50538259(CHEMBL4637500)
Affinity DataKi:  9nM. Assay description: Binding affinity to 6x-His-tagged human EphA2 ecto-domain residues (Lys27 to Asn529 residues) expressed in HEK293 cells incubated for 60 mins by fluo...
Ligand InfoKEGGPC cidPC sid
In DepthDetails ArticlePubMed