BDBM50540442 CHEMBL2088011
SMILES Oc1ccc(Cl)cc1C(=O)Nc1cccc(Cl)c1
InChI Key InChIKey=NXDGLRGDIKDWIF-UHFFFAOYSA-N
Data  5 IC50
  Tab Delimited (TSV)   2D SDfile   Computed 3D by Vconf -m prep SDfile
Find this compound or compounds like it in BindingDB:
Activity Spreadsheet -- Enzyme Inhibition Constant Data from BindingDB
Found 5 hits for monomerid = 50540442
TargetP2X purinoceptor 1(Homo sapiens (Human))
University Of Bonn
Curated by ChEMBL
LigandPNGBDBM50540442(CHEMBL2088011)
Affinity DataIC50:  76nM. Assay description: Antagonist activity at non-desensitizing human P2X1 receptor ( P2X2/P2X1 chimera) expressed in human 1321N1 cells assessed as inhibition of ATP-induc...
In DepthDetails ArticlePubMed
TargetP2X purinoceptor 2(Homo sapiens (Human))
University Of Bonn
Curated by ChEMBL
LigandPNGBDBM50540442(CHEMBL2088011)
Affinity DataIC50: >1.00E+4nM. Assay description: Antagonist activity at human P2X2 receptor expressed in human 1321N1 cells assessed as inhibition of ATP-induced cytosolic calcium influx preincubate...
In DepthDetails ArticlePubMed
TargetP2X purinoceptor 7(Homo sapiens (Human))
University Of Bonn
Curated by ChEMBL
LigandPNGBDBM50540442(CHEMBL2088011)
Affinity DataIC50:  599nM. Assay description: Antagonist activity at human P2X7 receptor expressed in human 1321N1 cells assessed as inhibition of ATP-induced cytosolic calcium influx preincubate...
In DepthDetails ArticlePubMed
TargetP2X purinoceptor 4(Homo sapiens (Human))
University Of Bonn
Curated by ChEMBL
LigandPNGBDBM50540442(CHEMBL2088011)
Affinity DataIC50:  135nM. Assay description: Antagonist activity at human P2X4 receptor expressed in human 1321N1 cells assessed as inhibition of ATP-induced cytosolic calcium influx preincubate...
In DepthDetails ArticlePubMed
TargetP2X purinoceptor 3(Homo sapiens (Human))
University Of Bonn
Curated by ChEMBL
LigandPNGBDBM50540442(CHEMBL2088011)
Affinity DataIC50: >1.00E+4nM. Assay description: Antagonist activity at human P2X3 receptor expressed in human 1321N1 cells assessed as inhibition of ATP-induced cytosolic calcium influx preincubate...
In DepthDetails ArticlePubMed