BDBM50542892 CHEMBL4638466
SMILES Cc1noc(C)c1-n1sc(=O)n(Cc2ccccc2)c1=O
InChI Key InChIKey=PLCUYXLBRVNJHG-UHFFFAOYSA-N
Data  2 IC50
  Tab Delimited (TSV)   2D SDfile   Computed 3D by Vconf -m prep SDfile
Find this compound or compounds like it in BindingDB:
Activity Spreadsheet -- Enzyme Inhibition Constant Data from BindingDB
Found 2 hits for monomerid = 50542892
TargetSortase family protein(Staphylococcus aureus)
Guizhou University
Curated by ChEMBL
LigandPNGBDBM50542892(CHEMBL4638466)
Affinity DataIC50:  4.60E+3nM. Assay description: Inhibition of Staphylococcus aureus SrtA delta N24 mutant expressed in Escherichia coli BL21 (DE3) assessed as reduction in IsdA (64 to 323 residues)...
Ligand InfoPC cidPC sid
In DepthDetails ArticlePubMed
TargetSortase family protein(Staphylococcus aureus)
Guizhou University
Curated by ChEMBL
LigandPNGBDBM50542892(CHEMBL4638466)
Affinity DataIC50:  800nM. Assay description: Inhibition of Staphylococcus aureus SrtA delta N24 mutant expressed in Escherichia coli BL21 (DE3) using Abz-LPATG-Dnp substrate incubated for 20 min...
Ligand InfoPC cidPC sid
In DepthDetails ArticlePubMed