BDBM50543151 CHEMBL4635547
SMILES Cc1c(ccc(=O)n1C)-c1cc(Cl)c2nn(cc2c1)C1CCNCC1
InChI Key InChIKey=ZUQIKGKGOADTSP-UHFFFAOYSA-N
Data  2 IC50
  Tab Delimited (TSV)   2D SDfile   Computed 3D by Vconf -m prep SDfile
Find this compound or compounds like it in BindingDB:
Activity Spreadsheet -- Enzyme Inhibition Constant Data from BindingDB
Found 2 hits for monomerid = 50543151
TargetToll-like receptor 8(Homo sapiens (Human))
Genomics Institute Of The Novartis Research Foundation
Curated by ChEMBL
LigandPNGBDBM50543151(CHEMBL4635547)
Affinity DataIC50:  30nM. Assay description: Antagonist activity at TLR8 in human PBMC assessed as inhibition of DOTAP-ssRNA40 induced TNFalpha production preincubated for 30 mins followed by ss...
Ligand InfoPC cidPC sid
In DepthDetails ArticlePubMed
TargetToll-like receptor 8(Homo sapiens (Human))
Genomics Institute Of The Novartis Research Foundation
Curated by ChEMBL
LigandPNGBDBM50543151(CHEMBL4635547)
Affinity DataIC50:  4.20E+3nM. Assay description: Displacement of 2-((1E,3E,5E)-5-(3,3-Dimethyl-1-(6-((4-(((3-methyl-5-(1H-pyrazolo[3,4-b]pyridin-4-yl)pyridin-2-yl)oxy)methyl)bicyclo[2.2.2]octan-1-yl...
Ligand InfoPC cidPC sid
In DepthDetails ArticlePubMed