BDBM50543535 CHEMBL4632639
SMILES CC#CC(CC(O)=O)c1ccc(OCc2cccc(CN3CCC4N=C(OC4C3)C3CC3)c2)cc1
InChI Key InChIKey=WPKLBSCLHAHZLO-UHFFFAOYSA-N
Data  1 EC50
  Tab Delimited (TSV)   2D SDfile   Computed 3D by Vconf -m prep SDfile
Find this compound or compounds like it in BindingDB:
Activity Spreadsheet -- Enzyme Inhibition Constant Data from BindingDB
Found 1 hit for monomerid = 50543535
TargetDipeptidyl peptidase 4(Homo sapiens (Human))
Mizoram University
Curated by ChEMBL
LigandPNGBDBM50543535(CHEMBL4632639)
Affinity DataEC50:  1.20nM. Assay description: Inhibition of DPP4 (unknown origin)
Ligand InfoPC cidPC sid
In DepthDetails ArticlePubMed