BDBM50544038 CHEMBL249033::US11459308, Compound 3514
SMILES CN1CCN(CC1)c1ccc(c(NCc2ccccc2)c1)[N+]([O-])=O
InChI Key InChIKey=LPOIGVZLNWEGJG-UHFFFAOYSA-N
Data  3 IC50
  Tab Delimited (TSV)   2D SDfile   Computed 3D by Vconf -m prep SDfile
Find this compound or compounds like it in BindingDB:
Activity Spreadsheet -- Enzyme Inhibition Constant Data from BindingDB
Found 2 hits for monomerid = 50544038
TargetEnvelope glycoprotein(ZEBOV)
Microbiotix
US Patent
LigandPNGBDBM50544038(CHEMBL249033 | US11459308, Compound 3514)
Affinity DataIC50:  1.50E+4nM. Assay description: The authentic filoviruses Ebola virus/H. sapiens-tc/COD/1995/Kikwit-9510621 (EBOV/Kik-9510621; ‘EBOV-Zaire 1995’) (Jahrling et al., J. Infect. Dis., ...
In DepthDetails US Patent
TargetEnvelope glycoprotein(REBOV)
Microbiotix
US Patent
LigandPNGBDBM50544038(CHEMBL249033 | US11459308, Compound 3514)
Affinity DataIC50:  9.50E+3nM. Assay description: Recombinant vesicular stomatitis viruses (VSVs) (serotype Indiana) expressing eGFP and EBOV, SUDV, or BDBV GP in place of VSV G, as well as those exp...
In DepthDetails US Patent