BDBM50545086 CHEMBL4648610
SMILES COc1ccccc1N(Cc1ccccc1[N+]([O-])=O)C(=O)\C=C\c1ccccc1
InChI Key InChIKey=DUNDXGPNJQDILH-FOCLMDBBSA-N
Data  1 Kd
  Tab Delimited (TSV)   2D SDfile   Computed 3D by Vconf -m prep SDfile
Find this compound or compounds like it in BindingDB:
Activity Spreadsheet -- Enzyme Inhibition Constant Data from BindingDB
Found 1 hit for monomerid = 50545086
TargetAlpha-synuclein(Homo sapiens (Human))
Fudan University
Curated by ChEMBL
LigandPNGBDBM50545086(CHEMBL4648610)
Affinity DataKd:  112nM. Assay description: Binding affinity to human wlid-type alpha-synuclein by SPR analysis
Ligand InfoPC cidPC sid
In DepthDetails ArticlePubMed