BDBM50545090 CHEMBL4634968
SMILES [O-][N+](=O)c1ccccc1CN(CCc1ccccc1)C(=O)\C=C\c1ccc(cc1)C#N
InChI Key InChIKey=CRVIKIBAEKSEHA-CCEZHUSRSA-N
Data  1 Kd
  Tab Delimited (TSV)   2D SDfile   Computed 3D by Vconf -m prep SDfile
Find this compound or compounds like it in BindingDB:
Activity Spreadsheet -- Enzyme Inhibition Constant Data from BindingDB
Found 1 hit for monomerid = 50545090
TargetAlpha-synuclein(Homo sapiens (Human))
Fudan University
Curated by ChEMBL
LigandPNGBDBM50545090(CHEMBL4634968)
Affinity DataKd:  116nM. Assay description: Binding affinity to human wlid-type alpha-synuclein by SPR analysis
Ligand InfoPC cidPC sid
In DepthDetails ArticlePubMed