BDBM50545093 CHEMBL4645133
SMILES CC(C)(C)NC(=O)c1ccc(\C=C\C(=O)N(Cc2ccccc2)Cc2ccccc2[N+]([O-])=O)cc1
InChI Key InChIKey=WWXDTZJLFRRACL-OBGWFSINSA-N
Data  1 Kd
  Tab Delimited (TSV)   2D SDfile   Computed 3D by Vconf -m prep SDfile
Find this compound or compounds like it in BindingDB:
Activity Spreadsheet -- Enzyme Inhibition Constant Data from BindingDB
Found 1 hit for monomerid = 50545093
TargetAlpha-synuclein(Homo sapiens (Human))
Fudan University
Curated by ChEMBL
LigandPNGBDBM50545093(CHEMBL4645133)
Affinity DataKd:  344nM. Assay description: Binding affinity to human wlid-type alpha-synuclein by SPR analysis
Ligand InfoPC cidPC sid
In DepthDetails ArticlePubMed