BDBM50545098 CHEMBL4644640
SMILES [O-][N+](=O)c1ccccc1CN(Cc1ccccc1)C(=O)\C=C\c1ccc(F)cc1
InChI Key InChIKey=IWNGRHSWCRSUJT-NTCAYCPXSA-N
Data  1 Kd
  Tab Delimited (TSV)   2D SDfile   Computed 3D by Vconf -m prep SDfile
Find this compound or compounds like it in BindingDB:
Activity Spreadsheet -- Enzyme Inhibition Constant Data from BindingDB
Found 1 hit for monomerid = 50545098
TargetAlpha-synuclein(Homo sapiens (Human))
Fudan University
Curated by ChEMBL
LigandPNGBDBM50545098(CHEMBL4644640)
Affinity DataKd:  47nM. Assay description: Binding affinity to human wlid-type alpha-synuclein by SPR analysis
Ligand InfoPC cidPC sid
In DepthDetails ArticlePubMed