BDBM50545099 CHEMBL4647336
SMILES COc1ccccc1CN(Cc1cc(F)ccc1[N+]([O-])=O)C(=O)\C=C\c1ccc(F)cc1
InChI Key InChIKey=ZDRWSXLQPKHITA-MDWZMJQESA-N
Data  1 Kd
  Tab Delimited (TSV)   2D SDfile   Computed 3D by Vconf -m prep SDfile
Find this compound or compounds like it in BindingDB:
Activity Spreadsheet -- Enzyme Inhibition Constant Data from BindingDB
Found 1 hit for monomerid = 50545099
TargetAlpha-synuclein(Homo sapiens (Human))
Fudan University
Curated by ChEMBL
LigandPNGBDBM50545099(CHEMBL4647336)
Affinity DataKd:  332nM. Assay description: Binding affinity to human wlid-type alpha-synuclein by SPR analysis
Ligand InfoPC cidPC sid
In DepthDetails ArticlePubMed