BDBM50545796 CHEMBL4642725
SMILES [H][C@@]12CCO[C@]1([H])OC[C@@H]2OC(=O)N[C@H](C[C@H](O)[C@H](Cc1ccccc1)NC(=O)COc1c(C)cccc1C)Cc1ccccc1
InChI Key InChIKey=GRHZLQBPAJAHDM-SPRQWYLLSA-N
Data  3 KI
PDB links: 1 PDB ID matches this monomer.
  Tab Delimited (TSV)   2D SDfile   Computed 3D by Vconf -m prep SDfile
Find this compound or compounds like it in BindingDB:
Activity Spreadsheet -- Enzyme Inhibition Constant Data from BindingDB
Found 3 hits for monomerid = 50545796
TargetGag-Pol polyprotein [489-587](Human immunodeficiency virus type 1)
University Of Massachusetts Medical School
Curated by ChEMBL
LigandPNGBDBM50545796(CHEMBL4642725)
Affinity DataKi:  0.0170nM. Assay description: Inhibition of HIV1 NL4-3 protease expressed in Escherichia coli TAP-106 cells using EDANS/DABCYL-labelled 10-amino acid containing protease cleavage ...
Ligand InfoPC cidPC sidPDB
TargetProtease(Human immunodeficiency virus 1 (HIV-1))
University Of Massachusetts Medical School
Curated by ChEMBL
LigandPNGBDBM50545796(CHEMBL4642725)
Affinity DataKi:  0.0690nM. Assay description: Inhibition of HIV1 NL4-3 protease I84V mutant expressed in Escherichia coli TAP-106 cells using EDANS/DABCYL-labelled 10-amino acid containing protea...
Ligand InfoPC cidPC sidPDB
TargetProtease(Human immunodeficiency virus 1 (HIV-1))
University Of Massachusetts Medical School
Curated by ChEMBL
LigandPNGBDBM50545796(CHEMBL4642725)
Affinity DataKi:  0.0720nM. Assay description: Inhibition of HIV1 NL4-3 protease I50V/A71V mutant expressed in Escherichia coli TAP-106 cells using EDANS/DABCYL-labelled 10-amino acid containing p...
Ligand InfoPC cidPC sidPDB