BDBM50545967 CHEMBL4791878::US11649241, Example 8
SMILES FC(F)Oc1ccc(Cl)cc1-c1n[nH]cc1NC(=O)c1cnc2[nH]ccc2n1
InChI Key InChIKey=VLGTVRUUTFWJMF-UHFFFAOYSA-N
Data  4 KI  1 IC50
  Tab Delimited (TSV)   2D SDfile   Computed 3D by Vconf -m prep SDfile
Find this compound or compounds like it in BindingDB:
Activity Spreadsheet -- Enzyme Inhibition Constant Data from BindingDB
Found 5 hits for monomerid = 50545967
TargetTyrosine-protein kinase JAK2(Homo sapiens (Human))
Genentech
US Patent
LigandPNGBDBM50545967(CHEMBL4791878 | US11649241, Example 8)
Affinity DataKi:  0.340nM. Assay description: The activity of the isolated recombinant JAK1 and JAK2 kinase domain was measured by monitoring phosphorylation of a peptide derived from JAK3 (Val-A...
Ligand InfoPC cidPC sid
In DepthDetails US Patent
TargetTyrosine-protein kinase JAK1(Homo sapiens (Human))
Genentech
US Patent
LigandPNGBDBM50545967(CHEMBL4791878 | US11649241, Example 8)
Affinity DataKi:  0.570nM. Assay description: The activity of the isolated recombinant JAK1 and JAK2 kinase domain was measured by monitoring phosphorylation of a peptide derived from JAK3 (Val-A...
Ligand InfoPC cidPC sid
In DepthDetails US Patent
TargetTyrosine-protein kinase JAK2(Homo sapiens (Human))
Genentech
US Patent
LigandPNGBDBM50545967(CHEMBL4791878 | US11649241, Example 8)
Affinity DataKi:  0.960nM. Assay description: Inhibition of recombinant human JAK2 (812 to 1132 residues) expressed in insect cells using Y1-B as substrate incubated for 30 mins by microfluidic m...
Ligand InfoPC cidPC sid
In DepthDetails ArticlePubMed
TargetTyrosine-protein kinase JAK1(Homo sapiens (Human))
Genentech
US Patent
LigandPNGBDBM50545967(CHEMBL4791878 | US11649241, Example 8)
Affinity DataKi:  5.60nM. Assay description: Inhibition of recombinant human JAK1 (854 to 1154 residues) expressed in insect cells using Y1-B as substrate incubated for 30 mins by microfluidic m...
Ligand InfoPC cidPC sid
In DepthDetails ArticlePubMed
LigandPNGBDBM50545967(CHEMBL4791878 | US11649241, Example 8)
Affinity DataIC50:  42nM. Assay description: Inhibition of JAK in human BEAS-2B cells assessed as reduction in IL13-induced STAT6 phosphorylation incubated for 1 hr followed by IL13 addition and...
Ligand InfoPC cidPC sid
In DepthDetails ArticlePubMed