BDBM50546260 CHEMBL4782926
SMILES CC(C)[C@H](NC(=O)[C@H](CCC(O)=O)NC(=O)[C@H](CC(O)=O)NC(C)=O)C(=O)N[C@@H](CC(O)=O)C(=O)C=O
InChI Key InChIKey=LUOWSNAZOQEWCS-RSLFNQERSA-N
Data  1 KI
  Tab Delimited (TSV)   2D SDfile   Computed 3D by Vconf -m prep SDfile
Find this compound or compounds like it in BindingDB:
Activity Spreadsheet -- Enzyme Inhibition Constant Data from BindingDB
Found 1 hit for monomerid = 50546260
TargetCaspase-3(Homo sapiens (Human))
Universit£
Curated by ChEMBL
LigandPNGBDBM50546260(CHEMBL4782926)
Affinity DataKi:  25nM. Assay description: Inhibition of caspase-3 (unknown origin) using Ac-DEVD-AMCA as substrate incubated for 5 mins by Dixon plot analysis
Ligand InfoKEGGPC cidPC sid
In DepthDetails ArticlePubMed