BDBM50546858 CHEMBL4743099
SMILES Cc1ccccc1-c1ccc(cc1)\N=N/c1ccc(CC2SC(=O)NC2=O)cc1
InChI Key InChIKey=OHQAGSOPRWRIQH-QPLCGJKRSA-N
Data  1 Kd  2 EC50
  Tab Delimited (TSV)   2D SDfile   Computed 3D by Vconf -m prep SDfile
Find this compound or compounds like it in BindingDB:
Activity Spreadsheet -- Enzyme Inhibition Constant Data from BindingDB
Found 3 hits for monomerid = 50546858
TargetPeroxisome proliferator-activated receptor gamma(Homo sapiens (Human))
New York University
Curated by ChEMBL
LigandPNGBDBM50546858(CHEMBL4743099)
Affinity DataEC50:  900nM. Assay description: Agonist activity at PPARy in human HepG2 cells transfected with human PPRE incubated for 14 to 16 hrs using pre-irradiated compound by firefly lucife...
Ligand InfoPC cidPC sid
In DepthDetails ArticlePubMed
TargetPeroxisome proliferator-activated receptor gamma(Homo sapiens (Human))
New York University
Curated by ChEMBL
LigandPNGBDBM50546858(CHEMBL4743099)
Affinity DataEC50:  6.40E+3nM. Assay description: Agonist activity at PPARgamma (unknown origin) expressed in HEK293T cells incubated for 14 to 16 hrs under irradiation by hybrid Gal4 reporter gene a...
Ligand InfoPC cidPC sid
In DepthDetails ArticlePubMed
TargetPeroxisome proliferator-activated receptor gamma(Homo sapiens (Human))
New York University
Curated by ChEMBL
LigandPNGBDBM50546858(CHEMBL4743099)
Affinity DataKd:  9.30E+3nM. Assay description: Binding affinity to recombinant PPARy LBD (unknown origin) expressed in Escherichia coli BL21 DE3 using pre-irradiated compound by ITC assay
Ligand InfoPC cidPC sid
In DepthDetails ArticlePubMed