BDBM50546874 CHEMBL4795025
SMILES CS(=O)(=O)SCCCCNC(=O)CC(CC(=O)NO)c1ccc(Cl)cc1Cl
InChI Key InChIKey=XOGDEXFLIBKJPB-UHFFFAOYSA-N
Data  1 KI
  Tab Delimited (TSV)   2D SDfile   Computed 3D by Vconf -m prep SDfile
Find this compound or compounds like it in BindingDB:
Activity Spreadsheet -- Enzyme Inhibition Constant Data from BindingDB
Found 1 hit for monomerid = 50546874
TargetBotulinum neurotoxin type A(Clostridium botulinum)
Boston University School Of Medicine
Curated by ChEMBL
LigandPNGBDBM50546874(CHEMBL4795025)
Affinity DataKi:  3.20E+4nM. Assay description: Time dependent inhibition of Clostridium botulinum BoNT/A light chain expressed in Escherichia coli BL21 (DE3) using SNAPtide flp6 as substrate by me...
Ligand InfoPC cidPC sid
In DepthDetails ArticlePubMed