BDBM50547491 CHEMBL4784916
SMILES ONC(=O)CCCCCCCOc1ccc(cc1)-c1csc(n1)N1N=C(\C(=N\Nc2nccs2)C1=O)c1ccccc1
InChI Key InChIKey=BQJZFOBZHOGRLS-FSRJSHLRSA-N
Data  1 IC50  1 EC50
  Tab Delimited (TSV)   2D SDfile   Computed 3D by Vconf -m prep SDfile
Find this compound or compounds like it in BindingDB:
Activity Spreadsheet -- Enzyme Inhibition Constant Data from BindingDB
Found 2 hits for monomerid = 50547491
TargetApoptosis regulator BAX(Homo sapiens (Human))
Shandong University
Curated by ChEMBL
LigandPNGBDBM50547491(CHEMBL4784916)
Affinity DataEC50:  532nM. Assay description: Binding affinity to recombinant human full length His-tagged BAX expressed in Escherichia coli BL21 (DE3) cells preincubated for 30 min followed by F...
Ligand InfoPC cidPC sid
In DepthDetails ArticlePubMed
TargetHistone deacetylase(Homo sapiens (Human))
Shandong University
Curated by ChEMBL
LigandPNGBDBM50547491(CHEMBL4784916)
Affinity DataIC50:  135nM. Assay description: Inhibition of HDAC in human HeLa nuclear extract using Boc-Lys(acetyl)-AMC or Boc-Lys (triflouroacetyl)-AMC as substrate preincubated for 5 mins foll...
Ligand InfoPC cidPC sid
In DepthDetails ArticlePubMed