BDBM50547973 CHEMBL4787548
SMILES Nc1ncnc2c(cc(cc12)-c1cn[nH]c1)C(=O)Nc1c(Cl)ccc(NS(=O)(=O)c2cc(F)ccc2F)c1F
InChI Key InChIKey=BXGNDUJPMMMICQ-UHFFFAOYSA-N
Data  2 IC50
  Tab Delimited (TSV)   2D SDfile   Computed 3D by Vconf -m prep SDfile
Find this compound or compounds like it in BindingDB:
Activity Spreadsheet -- Enzyme Inhibition Constant Data from BindingDB
Found 2 hits for monomerid = 50547973
TargetSerine/threonine-protein kinase/endoribonuclease IRE1(Homo sapiens (Human))
Paraza Pharma
Curated by ChEMBL
LigandPNGBDBM50547973(CHEMBL4787548)
Affinity DataIC50:  3.20E+3nM. Assay description: Inhibition of IRE1alpha (unknown origin) assessed as XBP-1 slicing luciferase activity incubated for 1 hr followed by stimulation with thapsigargin m...
Ligand InfoPC cidPC sid
In DepthDetails ArticlePubMed
TargetSerine/threonine-protein kinase/endoribonuclease IRE1(Homo sapiens (Human))
Paraza Pharma
Curated by ChEMBL
LigandPNGBDBM50547973(CHEMBL4787548)
Affinity DataIC50:  76nM. Assay description: Competitive inhibition of IRE1alpha LKR domain (Q470 to L997 residues) (unknown origin) expressed in Sf9 insect cells using mini-XBP-1 stem-loop RNA ...
Ligand InfoPC cidPC sid
In DepthDetails ArticlePubMed